BDBM50054622 3-(2,2-Dimethyl-1-phenyl-propyl)-4-hydroxy-6,6-dipropyl-5,6-dihydro-pyran-2-one::CHEMBL443822
SMILES CCCC1(CCC)CC(=O)C(C(c2ccccc2)C(C)(C)C)C(=O)O1
InChI Key InChIKey=UFIWWBUKCPODDQ-UHFFFAOYSA-N
Data  1 IC50
  Tab Delimited (TSV)   2D SDfile   Computed 3D by Vconf -m prep SDfile
Find this compound or compounds like it in BindingDB:
Activity Spreadsheet -- Enzyme Inhibition Constant Data from BindingDB
Found 1 hit for monomerid = 50054622
TargetGag-Pol polyprotein [489-587](Human immunodeficiency virus type 1)
Pharmacia & Upjohn
Curated by ChEMBL
LigandPNGBDBM50054622(3-(2,2-Dimethyl-1-phenyl-propyl)-4-hydroxy-6,6-dip...)
Affinity DataIC50: >1.00E+3nM. Assay description: HIV Protease inhibitory activity
In DepthDetails ArticlePubMed