BDBM50054766 5-(5-Chloro-thiophen-2-yl)-1-(4-hydroxy-5-hydroxymethyl-tetrahydro-furan-2-yl)-1H-pyrimidine-2,4-dione::CHEMBL2367577
SMILES OC[C@H]1O[C@H](C[C@@H]1O)n1cc(-c2ccc(Cl)s2)c(=O)[nH]c1=O
InChI Key InChIKey=RQZRQHNKLHIOQI-UHFFFAOYSA-N
Data  1 IC50
  Tab Delimited (TSV)   2D SDfile   Computed 3D by Vconf -m prep SDfile
Find this compound or compounds like it in BindingDB:
Activity Spreadsheet -- Enzyme Inhibition Constant Data from BindingDB
Found 1 hit for monomerid = 50054766
TargetThymidine kinase(Human herpesvirus 1 (strain SC16) (HHV-1) (Human h...)
Katholieke Universiteit Leuven
Curated by ChEMBL
LigandPNGBDBM50054766(5-(5-Chloro-thiophen-2-yl)-1-(4-hydroxy-5-hydroxym...)
Affinity DataIC50:  2.30E+3nM. Assay description: Binding affinity towards HSV-1 thymidine kinase
In DepthDetails ArticlePubMed