BDBM50054790 CHEMBL3318981
SMILES OC12CCC(CC1)(C2)c1nnc2c(Oc3ccccc3F)cccn12
InChI Key InChIKey=WEOITARZWXYXSX-UHFFFAOYSA-N
Data  1 IC50
PDB links: 1 PDB ID matches this monomer.
  Tab Delimited (TSV)   2D SDfile   Computed 3D by Vconf -m prep SDfile
Find this compound or compounds like it in BindingDB:
Activity Spreadsheet -- Enzyme Inhibition Constant Data from BindingDB
Found 1 hit for monomerid = 50054790
Target11-beta-hydroxysteroid dehydrogenase 1(Homo sapiens (Human))
Bristol-Myers Squibb
Curated by ChEMBL
LigandPNGBDBM50054790(CHEMBL3318981)
Affinity DataIC50:  5.10nM. Assay description: Inhibition of human recombinant 11beta-HSD-1 expressed in HEK293 EBNA cells using [3H]-cortisone and NADPH by scintillation proximity assay