BDBM50054861 (E)-Non-3-enoic acid acetyl-[1-[1-[1-(1-carbamoyl-4-guanidino-butylcarbamoyl)-3-methyl-butylcarbamoyl]-2-(4-guanidino-phenyl)-ethylcarbamoyl]-2-(4-fluoro-phenyl)-ethyl]-amide::CHEMBL145143
SMILES [#6]-[#6]-[#6]-[#6]-[#6]\[#6]=[#6]\[#6]-[#6](=O)-[#7](-[#6](-[#6]-c1ccc(F)cc1)-[#6](=O)-[#7]-[#6](-[#6]-c1ccc(cc1)\[#7]=[#6](\[#7])-[#7])-[#6](=O)-[#7]-[#6](-[#6]-[#6](-[#6])-[#6])-[#6](=O)-[#7]-[#6](-[#6]-[#6]-[#6]-[#7]-[#6](-[#7])=[#7])-[#6](-[#7])=O)-[#6](-[#6])=O
InChI Key InChIKey=NMAMOGNFAXTZNU-MDZDMXLPSA-N
Data  2 IC50
  Tab Delimited (TSV)   2D SDfile   Computed 3D by Vconf -m prep SDfile
Find this compound or compounds like it in BindingDB:
Activity Spreadsheet -- Enzyme Inhibition Constant Data from BindingDB
Found 2 hits for monomerid = 50054861
TargetProteinase-activated receptor 1(Homo sapiens (Human))
Bristol-Myers Squibb Pharmaceutical Research Institute
Curated by ChEMBL
LigandPNGBDBM50054861((E)-Non-3-enoic acid acetyl-[1-[1-[1-(1-carbamoyl-...)
Affinity DataIC50:  7.60E+3nM. Assay description: Concentration required to inhibit agonist (SFFLRR-NH2, at 3 uM) induced platelet aggregation by 50%
In DepthDetails ArticlePubMed
TargetProteinase-activated receptor 1(Homo sapiens (Human))
Bristol-Myers Squibb Pharmaceutical Research Institute
Curated by ChEMBL
LigandPNGBDBM50054861((E)-Non-3-enoic acid acetyl-[1-[1-[1-(1-carbamoyl-...)
Affinity DataIC50:  35nM. Assay description: Antagonistic activity against tritiated agonist (SFFLRR-NH2, at 25 nM) binding to human platelet membranes measured by the GTPase assay
In DepthDetails ArticlePubMed