BDBM50054875 2-[2-[2-{Acetyl-[(E)-3-(4-fluoro-phenyl)-acryloyl]-amino}-3-(4-fluoro-phenyl)-propionylamino]-3-(4-guanidino-phenyl)-propionylamino]-4-methyl-pentanoic acid (1-carbamoyl-4-guanidino-butyl)-amide::CHEMBL356557
SMILES [#6]-[#6](-[#6])-[#6]-[#6](-[#7]-[#6](=O)-[#6](-[#6]-c1ccc(cc1)\[#7]=[#6](\[#7])-[#7])-[#7]-[#6](=O)-[#6](-[#6]-c1ccc(F)cc1)-[#7](-[#6](-[#6])=O)-[#6](=O)-[#6]=[#6]-c1ccc(F)cc1)-[#6](=O)-[#7]-[#6](-[#6]-[#6]-[#6]-[#7]-[#6](-[#7])=[#7])-[#6](-[#7])=O
InChI Key InChIKey=KCTPZCIBSRZWKC-UHFFFAOYSA-N
Data  3 IC50
  Tab Delimited (TSV)   2D SDfile   Computed 3D by Vconf -m prep SDfile
Find this compound or compounds like it in BindingDB:
Activity Spreadsheet -- Enzyme Inhibition Constant Data from BindingDB
Found 3 hits for monomerid = 50054875
TargetProteinase-activated receptor 1(Homo sapiens (Human))
Bristol-Myers Squibb Pharmaceutical Research Institute
Curated by ChEMBL
LigandPNGBDBM50054875(2-[2-[2-{Acetyl-[(E)-3-(4-fluoro-phenyl)-acryloyl]...)
Affinity DataIC50:  23nM. Assay description: Antagonistic activity against tritiated agonist (SFFLRR-NH2, at 25 nM) binding to human platelet membranes measured by the GTPase assay
In DepthDetails ArticlePubMed
TargetProteinase-activated receptor 1(Homo sapiens (Human))
Bristol-Myers Squibb Pharmaceutical Research Institute
Curated by ChEMBL
LigandPNGBDBM50054875(2-[2-[2-{Acetyl-[(E)-3-(4-fluoro-phenyl)-acryloyl]...)
Affinity DataIC50:  90nM. Assay description: Concentration required to inhibit agonist (SFFLRR-NH2, at 3 uM) induced platelet aggregation by 50%
In DepthDetails ArticlePubMed
TargetProteinase-activated receptor 1(Homo sapiens (Human))
Bristol-Myers Squibb Pharmaceutical Research Institute
Curated by ChEMBL
LigandPNGBDBM50054875(2-[2-[2-{Acetyl-[(E)-3-(4-fluoro-phenyl)-acryloyl]...)
Affinity DataIC50:  90nM. Assay description: Concentration required to inhibit agonist (SFFLRR-NH2, at 3 uM) induced platelet aggregation by 50%
In DepthDetails ArticlePubMed