BDBM50054897 2-[2-[2-[Acetyl-(3-propionyl-phenyl)-amino]-3-(4-fluoro-phenyl)-propionylamino]-3-(4-guanidino-phenyl)-propionylamino]-4-methyl-pentanoic acid [1-(1-carbamoyl-4-guanidino-butylcarbamoyl)-4-guanidino-butyl]-amide::CHEMBL385971
SMILES [#6]-[#6]-[#6](=O)-c1cccc(c1)-[#7](-[#6](-[#6]-c1ccc(F)cc1)-[#6](=O)-[#7]-[#6](-[#6]-c1ccc(cc1)\[#7]=[#6](\[#7])-[#7])-[#6](=O)-[#7]-[#6](-[#6]-[#6](-[#6])-[#6])-[#6](=O)-[#7]-[#6](-[#6]-[#6]-[#6]-[#7]-[#6](-[#7])=[#7])-[#6](=O)-[#7]-[#6](-[#6]-[#6]-[#6]-[#7]-[#6](-[#7])=[#7])-[#6](-[#7])=O)-[#6](-[#6])=O
InChI Key InChIKey=KAIYINHMJDBHNL-UHFFFAOYSA-N
Data  2 IC50
  Tab Delimited (TSV)   2D SDfile   Computed 3D by Vconf -m prep SDfile
Find this compound or compounds like it in BindingDB:
Activity Spreadsheet -- Enzyme Inhibition Constant Data from BindingDB
Found 2 hits for monomerid = 50054897
TargetProteinase-activated receptor 1(Homo sapiens (Human))
Bristol-Myers Squibb Pharmaceutical Research Institute
Curated by ChEMBL
LigandPNGBDBM50054897(2-[2-[2-[Acetyl-(3-propionyl-phenyl)-amino]-3-(4-f...)
Affinity DataIC50:  250nM. Assay description: Concentration required to inhibit agonist (SFFLRR-NH2, at 3 uM) induced platelet aggregation by 50%
In DepthDetails ArticlePubMed
TargetProteinase-activated receptor 1(Homo sapiens (Human))
Bristol-Myers Squibb Pharmaceutical Research Institute
Curated by ChEMBL
LigandPNGBDBM50054897(2-[2-[2-[Acetyl-(3-propionyl-phenyl)-amino]-3-(4-f...)
Affinity DataIC50:  9nM. Assay description: Antagonistic activity against tritiated agonist (SFFLRR-NH2, at 25 nM) binding to human platelet membranes measured by the GTPase assay
In DepthDetails ArticlePubMed