BDBM50055161 (S)-2-(4-Cyano-phenyl)-2-hydroxy-4,4-dimethyl-morpholin-4-ium; bromide::CHEMBL334938::CHEMBL342564
SMILES C[N+]1(C)CCO[C@](O)(C1)c1ccc(cc1)C#N
InChI Key InChIKey=RGVDZQMQMFJHRD-CYBMUJFWSA-N
Data  2 IC50
  Tab Delimited (TSV)   2D SDfile   Computed 3D by Vconf -m prep SDfile
Find this compound or compounds like it in BindingDB:
Activity Spreadsheet -- Enzyme Inhibition Constant Data from BindingDB
Found 2 hits for monomerid = 50055161
TargetAcetylcholinesterase(Homo sapiens (Human))
Harvard University
Curated by ChEMBL
LigandPNGBDBM50055161((S)-2-(4-Cyano-phenyl)-2-hydroxy-4,4-dimethyl-morp...)
Affinity DataIC50:  1.16E+7nM. Assay description: Inhibition acetylcholinesterase (AChE) enzyme.
In DepthDetails ArticlePubMed
TargetAcetylcholinesterase(Tetronarce californica (Pacific electric ray) (Tor...)
University Of North Carolina
Curated by ChEMBL
LigandPNGBDBM50055161((S)-2-(4-Cyano-phenyl)-2-hydroxy-4,4-dimethyl-morp...)
Affinity DataIC50:  1.16E+7nM. Assay description: Inhibitory activity against Acetylcholinesterase
In DepthDetails ArticlePubMed