BDBM50055169 (3-Bromo-propyl)-trimethyl-ammonium; bromide::CHEMBL139684::CHEMBL145957
SMILES C[N+](C)(C)CCCBr
InChI Key InChIKey=ZPRBOWQPJKXKDP-UHFFFAOYSA-N
Data  2 IC50
  Tab Delimited (TSV)   2D SDfile   Computed 3D by Vconf -m prep SDfile
Find this compound or compounds like it in BindingDB:
Activity Spreadsheet -- Enzyme Inhibition Constant Data from BindingDB
Found 2 hits for monomerid = 50055169
TargetAcetylcholinesterase(Homo sapiens (Human))
Harvard University
Curated by ChEMBL
LigandPNGBDBM50055169((3-Bromo-propyl)-trimethyl-ammonium; bromide | CHE...)
Affinity DataIC50:  8.79E+4nM. Assay description: Inhibition acetylcholinesterase (AChE) enzyme.
In DepthDetails ArticlePubMed
TargetAcetylcholinesterase(Tetronarce californica (Pacific electric ray) (Tor...)
University Of North Carolina
Curated by ChEMBL
LigandPNGBDBM50055169((3-Bromo-propyl)-trimethyl-ammonium; bromide | CHE...)
Affinity DataIC50:  8.79E+4nM. Assay description: Inhibitory activity against Acetylcholinesterase
In DepthDetails ArticlePubMed