BDBM50055170 (2-Chloro-ethyl)-trimethyl-ammonium; chloride::CHEMBL118539::CHEMBL341956
SMILES C[N+](C)(C)CCCl
InChI Key InChIKey=JUZXDNPBRPUIOR-UHFFFAOYSA-N
Data  2 IC50
  Tab Delimited (TSV)   2D SDfile   Computed 3D by Vconf -m prep SDfile
Find this compound or compounds like it in BindingDB:
Activity Spreadsheet -- Enzyme Inhibition Constant Data from BindingDB
Found 2 hits for monomerid = 50055170
TargetAcetylcholinesterase(Homo sapiens (Human))
Harvard University
Curated by ChEMBL
LigandPNGBDBM50055170((2-Chloro-ethyl)-trimethyl-ammonium; chloride | CH...)
Affinity DataIC50:  2.39E+6nM. Assay description: Inhibition acetylcholinesterase (AChE) enzyme.
In DepthDetails ArticlePubMed
TargetAcetylcholinesterase(Tetronarce californica (Pacific electric ray) (Tor...)
University Of North Carolina
Curated by ChEMBL
LigandPNGBDBM50055170((2-Chloro-ethyl)-trimethyl-ammonium; chloride | CH...)
Affinity DataIC50:  2.39E+6nM. Assay description: Inhibitory activity against Acetylcholinesterase
In DepthDetails ArticlePubMed