BDBM50055180 (5-Methoxy-2-methyl-phenyl)-trimethyl-ammonium::CHEMBL136870
SMILES COc1ccc(C)c(c1)[N+](C)(C)C
InChI Key InChIKey=ZRJNTMHQIDCDLL-UHFFFAOYSA-N
Data  2 IC50
  Tab Delimited (TSV)   2D SDfile   Computed 3D by Vconf -m prep SDfile
Find this compound or compounds like it in BindingDB:
Activity Spreadsheet -- Enzyme Inhibition Constant Data from BindingDB
Found 2 hits for monomerid = 50055180
TargetAcetylcholinesterase(Homo sapiens (Human))
Harvard University
Curated by ChEMBL
LigandPNGBDBM50055180((5-Methoxy-2-methyl-phenyl)-trimethyl-ammonium | C...)
Affinity DataIC50:  3.45E+5nM. Assay description: Inhibition acetylcholinesterase (AChE) enzyme.
In DepthDetails ArticlePubMed
TargetAcetylcholinesterase(Electrophorus electricus (Electric eel))
University Of North Carolina
Curated by ChEMBL
LigandPNGBDBM50055180((5-Methoxy-2-methyl-phenyl)-trimethyl-ammonium | C...)
Affinity DataIC50:  3.45E+5nM. Assay description: Inhibitory activity against Acetylcholinesterase
In DepthDetails ArticlePubMed