BDBM50055189 (3-Acetylamino-phenyl)-trimethyl-ammonium; bromide::CHEMBL137226::CHEMBL342537
SMILES CC(=O)Nc1cccc(c1)[N+](C)(C)C
InChI Key InChIKey=BJTGKIAXWCJQOU-UHFFFAOYSA-O
Data  2 IC50
  Tab Delimited (TSV)   2D SDfile   Computed 3D by Vconf -m prep SDfile
Find this compound or compounds like it in BindingDB:
Activity Spreadsheet -- Enzyme Inhibition Constant Data from BindingDB
Found 2 hits for monomerid = 50055189
TargetAcetylcholinesterase(Homo sapiens (Human))
Harvard University
Curated by ChEMBL
LigandPNGBDBM50055189((3-Acetylamino-phenyl)-trimethyl-ammonium; bromide...)
Affinity DataIC50:  1.00E+6nM. Assay description: Inhibition acetylcholinesterase (AChE) enzyme.
In DepthDetails ArticlePubMed
TargetAcetylcholinesterase(Tetronarce californica (Pacific electric ray) (Tor...)
University Of North Carolina
Curated by ChEMBL
LigandPNGBDBM50055189((3-Acetylamino-phenyl)-trimethyl-ammonium; bromide...)
Affinity DataIC50:  1.00E+6nM. Assay description: Inhibitory activity against Acetylcholinesterase
In DepthDetails ArticlePubMed