BDBM50055193 CHEMBL138072::Trimethyl-(4-methyl-3-propionyloxy-phenyl)-ammonium
SMILES CCC(=O)Oc1cc(ccc1C)[N+](C)(C)C
InChI Key InChIKey=MNIMLCHZPSYBJD-UHFFFAOYSA-N
Data  2 IC50
  Tab Delimited (TSV)   2D SDfile   Computed 3D by Vconf -m prep SDfile
Find this compound or compounds like it in BindingDB:
Activity Spreadsheet -- Enzyme Inhibition Constant Data from BindingDB
Found 2 hits for monomerid = 50055193
TargetAcetylcholinesterase(Homo sapiens (Human))
Harvard University
Curated by ChEMBL
LigandPNGBDBM50055193(CHEMBL138072 | Trimethyl-(4-methyl-3-propionyloxy-...)
Affinity DataIC50:  3.77E+3nM. Assay description: Inhibition acetylcholinesterase (AChE) enzyme.
In DepthDetails ArticlePubMed
TargetAcetylcholinesterase(Electrophorus electricus (Electric eel))
University Of North Carolina
Curated by ChEMBL
LigandPNGBDBM50055193(CHEMBL138072 | Trimethyl-(4-methyl-3-propionyloxy-...)
Affinity DataIC50:  3.77E+3nM. Assay description: Inhibitory activity against Acetylcholinesterase
In DepthDetails ArticlePubMed