BDBM50056035 CHEMBL107336::Pyrimidine-4-carboxylic acid {2-[4-(2-methoxy-phenyl)-piperazin-1-yl]-ethyl}-amide
SMILES COc1ccccc1N1CCN(CCNC(=O)c2ccncn2)CC1
InChI Key InChIKey=JUASUUUSTHHWOL-UHFFFAOYSA-N
Data  2 KI
  Tab Delimited (TSV)   2D SDfile   Computed 3D by Vconf -m prep SDfile
Find this compound or compounds like it in BindingDB:
Activity Spreadsheet -- Enzyme Inhibition Constant Data from BindingDB
Found 2 hits for monomerid = 50056035
Target5-hydroxytryptamine receptor 1A(Rattus norvegicus (rat))
Solvay Pharma
Curated by ChEMBL
LigandPNGBDBM50056035(CHEMBL107336 | Pyrimidine-4-carboxylic acid {2-[4-...)
Affinity DataKi:  15nM. Assay description: Binding affinity was evaluated by determining in vitro displacement of [3H]-8-OH-DPAT from the central 5-hydroxytryptamine 1A receptor recognition si...
In DepthDetails ArticlePubMed
TargetD(2) dopamine receptor(Rattus norvegicus (rat))
Solvay Pharma
Curated by ChEMBL
LigandPNGBDBM50056035(CHEMBL107336 | Pyrimidine-4-carboxylic acid {2-[4-...)
Affinity DataKi:  250nM. Assay description: In vitro displacement of [3H]-spiperone from Dopamine receptor D2 binding site in rat striatum.
In DepthDetails ArticlePubMed