BDBM50056094 1-(3-Amino-phenyl)-3-[(R)-1-(3,3-dimethyl-2-oxo-butyl)-2-oxo-5-phenyl-2,3-dihydro-1H-benzo[e][1,4]diazepin-3-yl]-urea::CHEMBL430516
SMILES CC(C)(C)C(=O)CN1c2ccccc2C(=N[C@@H](NC(=O)Nc2cccc(N)c2)C1=O)c1ccccc1
InChI Key InChIKey=BCKBRPCMBQSENO-VWLOTQADSA-N
Data  2 IC50
  Tab Delimited (TSV)   2D SDfile   Computed 3D by Vconf -m prep SDfile
Find this compound or compounds like it in BindingDB:
Activity Spreadsheet -- Enzyme Inhibition Constant Data from BindingDB
Found 2 hits for monomerid = 50056094
TargetCholecystokinin receptor type A(RAT)
Ferring Research Institute
Curated by ChEMBL
LigandPNGBDBM50056094(1-(3-Amino-phenyl)-3-[(R)-1-(3,3-dimethyl-2-oxo-bu...)
Affinity DataIC50:  953nM. Assay description: Inhibitory concentration against radioligand [3 H]L-364,718 binding to gastrin/Cholecystokinin type A receptor from rat pancreas
In DepthDetails ArticlePubMed
TargetGastrin/cholecystokinin type B receptor(RAT)
Ferring Research Institute
Curated by ChEMBL
LigandPNGBDBM50056094(1-(3-Amino-phenyl)-3-[(R)-1-(3,3-dimethyl-2-oxo-bu...)
Affinity DataIC50:  0.5nM. Assay description: Inhibitory concentration against radioligand [125I]-CCK-8 binding to gastrin/Cholecystokinin type B receptor from rat brain
In DepthDetails ArticlePubMed