BDBM500564 7-[[5-[(3R)-3- (1-hydroxy-1- methyl-ethyl)- 1-piperipyl]-2- pyridyl]-amino]-4-(1- methylindol-4- yl)-2,3-dihydropyrrolo [3,4-c]pyridin-1-one::US11021481, Compound I-223::US11078201, Compound I-223::US11548890, Compound I-223
SMILES Cn1ccc2c(cccc12)-c1ncc(Nc2ccc(cn2)N2CCC[C@H](C2)C(C)(C)O)c2C(=O)NCc12
InChI Key InChIKey=SULDFGSTOCFBSD-GOSISDBHSA-N
Data  5 IC50
  Tab Delimited (TSV)   2D SDfile   Computed 3D by Vconf -m prep SDfile
Find this compound or compounds like it in BindingDB:
Activity Spreadsheet -- Enzyme Inhibition Constant Data from BindingDB
Found 5 hits for monomerid = 500564
TargetMitogen-activated protein kinase kinase kinase kinase 1(Homo sapiens (Human))
Nimbus Saturn
US Patent
LigandPNGBDBM500564(7-[[5-[(3R)-3- (1-hydroxy-1- methyl-ethyl)- 1-pipe...)
Affinity DataIC50: <100nM. Assay description: HPK1 biochemical enzyme assay: HPK1 enzyme inhibition was measured using a microfluidic mobility shift assay. Reactions were performed in a 384-well ...
Ligand InfoPC cidPC sid
In DepthDetails US Patent
TargetMitogen-activated protein kinase kinase kinase kinase 1(Homo sapiens (Human))
Nimbus Saturn
US Patent
LigandPNGBDBM500564(7-[[5-[(3R)-3- (1-hydroxy-1- methyl-ethyl)- 1-pipe...)
Affinity DataIC50: <100nM. Assay description: HPK1 biochemical enzyme assay: HPK1 enzyme inhibition was measured using a microfluidic mobility shift assay. Reactions were performed in a 384-well ...
Ligand InfoPC cidPC sid
In DepthDetails US Patent
TargetMitogen-activated protein kinase kinase kinase kinase 1(Homo sapiens (Human))
Nimbus Saturn
US Patent
LigandPNGBDBM500564(7-[[5-[(3R)-3- (1-hydroxy-1- methyl-ethyl)- 1-pipe...)
Affinity DataIC50: <100nM. Assay description: HPK1 biochemical enzyme assay: HPK1 enzyme inhibition was measured using a microfluidic mobility shift assay. Reactions were performed in a 384-well ...
Ligand InfoPC cidPC sid
In DepthDetails US Patent
TargetMitogen-activated protein kinase kinase kinase kinase 1(Homo sapiens (Human))
Nimbus Saturn
US Patent
LigandPNGBDBM500564(7-[[5-[(3R)-3- (1-hydroxy-1- methyl-ethyl)- 1-pipe...)
Affinity DataIC50: <100nM. Assay description: HPK1 biochemical enzyme assay: HPK1 enzyme inhibition was measured using a microfluidic mobility shift assay. Reactions were performed in a 384-well ...
Ligand InfoPC cidPC sid
In DepthDetails US Patent
TargetMitogen-activated protein kinase kinase kinase kinase 1(Homo sapiens (Human))
Nimbus Saturn
US Patent
LigandPNGBDBM500564(7-[[5-[(3R)-3- (1-hydroxy-1- methyl-ethyl)- 1-pipe...)
Affinity DataIC50: <100nM. Assay description: HPK1 biochemical enzyme assay: HPK1 enzyme inhibition was measured using a microfluidic mobility shift assay. Reactions were performed in a 384-well ...
Ligand InfoPC cidPC sid
In DepthDetails US Patent