BDBM50056474 (5Z,8Z,11Z,14Z)-Icosa-5,8,11,14-tetraenoic acid ethyl-(2-hydroxy-ethyl)-amide::CHEMBL161596
SMILES CCCCC\C=C/C\C=C/C\C=C/C\C=C/CCCC(=O)N(CC)CCO
InChI Key InChIKey=ZKXQQBCGUNURKP-GKFVBPDJSA-N
Data  1 KI
  Tab Delimited (TSV)   2D SDfile   Computed 3D by Vconf -m prep SDfile
Find this compound or compounds like it in BindingDB:
Activity Spreadsheet -- Enzyme Inhibition Constant Data from BindingDB
Found 1 hit for monomerid = 50056474
TargetCannabinoid receptor 1(Rattus norvegicus (rat))
Hebrew University
Curated by ChEMBL
LigandPNGBDBM50056474((5Z,8Z,11Z,14Z)-Icosa-5,8,11,14-tetraenoic acid et...)
Affinity DataKi: >1.00E+4nM. Assay description: In vitro binding affinity was determined against rat brain Cannabinoid receptor 1
In DepthDetails ArticlePubMed