BDBM50056906 (2,4-Dihydroxy-phenyl)-(2,4,6-trinitro-phenyl)-methanone::CHEMBL176754::NSC-338104
SMILES Oc1ccc(C(=O)c2c(cc(cc2[N+]([O-])=O)[N+]([O-])=O)[N+]([O-])=O)c(O)c1
InChI Key InChIKey=HKDQDHNTRCZHQR-UHFFFAOYSA-N
Data  4 IC50
  Tab Delimited (TSV)   2D SDfile   Computed 3D by Vconf -m prep SDfile
Find this compound or compounds like it in BindingDB:
Activity Spreadsheet -- Enzyme Inhibition Constant Data from BindingDB
Found 4 hits for monomerid = 50056906
TargetIntegrase(Human immunodeficiency virus 1)
National Cancer Institute-Bethesda
Curated by ChEMBL
LigandPNGBDBM50056906((2,4-Dihydroxy-phenyl)-(2,4,6-trinitro-phenyl)-met...)
Affinity DataIC50:  5.44E+4nM. Assay description: Inhibitory concentration of compound against strand transfer of HIV-1 integrase in experiment 2
In DepthDetails ArticlePubMed
TargetIntegrase(Human immunodeficiency virus 1)
National Cancer Institute-Bethesda
Curated by ChEMBL
LigandPNGBDBM50056906((2,4-Dihydroxy-phenyl)-(2,4,6-trinitro-phenyl)-met...)
Affinity DataIC50:  6.62E+4nM. Assay description: Inhibitory concentration of compound against 3'-processing of HIV-1 integrase in experiment 1
In DepthDetails ArticlePubMed
TargetIntegrase(Human immunodeficiency virus 1)
National Cancer Institute-Bethesda
Curated by ChEMBL
LigandPNGBDBM50056906((2,4-Dihydroxy-phenyl)-(2,4,6-trinitro-phenyl)-met...)
Affinity DataIC50:  8.82E+4nM. Assay description: Inhibitory concentration of compound against strand transfer of HIV-1 integrase in experiment 1
In DepthDetails ArticlePubMed
TargetIntegrase(Human immunodeficiency virus 1)
National Cancer Institute-Bethesda
Curated by ChEMBL
LigandPNGBDBM50056906((2,4-Dihydroxy-phenyl)-(2,4,6-trinitro-phenyl)-met...)
Affinity DataIC50:  6.70E+4nM. Assay description: Inhibitory concentration of compound against 3'-processing of HIV-1 integrase in experiment 2
In DepthDetails ArticlePubMed