BDBM50057409 CHEMBL3326432
SMILES Cc1cccc(=S)n1O
InChI Key InChIKey=KVLOEFKBTCCASR-UHFFFAOYSA-N
Data  1 KI
PDB links: 1 PDB ID matches this monomer.
  Tab Delimited (TSV)   2D SDfile   Computed 3D by Vconf -m prep SDfile
Find this compound or compounds like it in BindingDB:
Activity Spreadsheet -- Enzyme Inhibition Constant Data from BindingDB
Found 1 hit for monomerid = 50057409
TargetCarbonic anhydrase 2(Homo sapiens (Human))
University Of California
Curated by ChEMBL
LigandPNGBDBM50057409(CHEMBL3326432)
Affinity DataKi:  2.30E+6nM. Assay description: Inhibition of human carbonic anhydrase using p-nitrophenylacetate as substrate preincubated for 10 mins before substrate addition by spectrophotometr...