BDBM50057523 4-[5-(4-Hydroxy-phenyl)-3-trifluoromethyl-pyrazol-1-yl]-benzenesulfonamide::CHEMBL282390
SMILES NS(=O)(=O)c1ccc(cc1)-n1nc(cc1-c1ccc(O)cc1)C(F)(F)F
InChI Key InChIKey=GWKIGBPJRYWOIQ-UHFFFAOYSA-N
Data  2 IC50
  Tab Delimited (TSV)   2D SDfile   Computed 3D by Vconf -m prep SDfile
Find this compound or compounds like it in BindingDB:
Activity Spreadsheet -- Enzyme Inhibition Constant Data from BindingDB
Found 2 hits for monomerid = 50057523
TargetProstaglandin G/H synthase 2(Homo sapiens (Human))
Searle Research And Development
Curated by ChEMBL
LigandPNGBDBM50057523(4-[5-(4-Hydroxy-phenyl)-3-trifluoromethyl-pyrazol-...)
Affinity DataIC50: >1.00E+5nM. Assay description: In vitro inhibitory concentration required to block human recombinant prostaglandin G/H synthase 2 (COX-2)
In DepthDetails ArticlePubMed
TargetProstaglandin G/H synthase 1(Homo sapiens (Human))
Searle Research And Development
Curated by ChEMBL
LigandPNGBDBM50057523(4-[5-(4-Hydroxy-phenyl)-3-trifluoromethyl-pyrazol-...)
Affinity DataIC50: >1.00E+5nM. Assay description: In vitro inhibitory concentration required to block recombinant human prostaglandin G/H synthase 1 (COX-1)
In DepthDetails ArticlePubMed