BDBM50057649 CHEMBL3326456
SMILES [H][C@@]12[C@@H](O)CCN1N=C([C@H]2OC(C)C)c1ccc(C#N)c(Cl)c1C
InChI Key InChIKey=DFCZRPFNJWFTFF-RRQGHBQHSA-N
Data  1 EC50
  Tab Delimited (TSV)   2D SDfile   Computed 3D by Vconf -m prep SDfile
Find this compound or compounds like it in BindingDB:
Activity Spreadsheet -- Enzyme Inhibition Constant Data from BindingDB
Found 1 hit for monomerid = 50057649
TargetAndrogen receptor(Homo sapiens (Human))
Novartis Institutes For Biomedical Research
Curated by ChEMBL
LigandPNGBDBM50057649(CHEMBL3326456)
Affinity DataEC50:  4.5nM. Assay description: Agonist activity at human androgen receptor expressed in mouse C2C12 cells by androgen-specific response element-driven luciferase reporter gene assa...
In DepthDetails ArticlePubMed