BDBM50057810 1-(4-Azido-5-hydroxymethyl-tetrahydro-furan-2-yl)-3-(2-hydroxy-ethyl)-5-methyl-1H-pyrimidine-2,4-dione::CHEMBL290327
SMILES Cc1cn(C2CC(N=[N+]=[N-])C(CO)O2)c(=O)n(CCO)c1=O
InChI Key InChIKey=CSDPGDMVFZGRDF-UHFFFAOYSA-N
Data  1 EC50
  Tab Delimited (TSV)   2D SDfile   Computed 3D by Vconf -m prep SDfile
Find this compound or compounds like it in BindingDB:
Activity Spreadsheet -- Enzyme Inhibition Constant Data from BindingDB
Found 1 hit for monomerid = 50057810
TargetReverse transcriptase/RNaseH(Human immunodeficiency virus 1)
Institut De Chimie Des Substances Naturelles Cnrs
Curated by ChEMBL
LigandPNGBDBM50057810(1-(4-Azido-5-hydroxymethyl-tetrahydro-furan-2-yl)-...)
Affinity DataEC50:  90nM. Assay description: Reverse transcriptase activity was measured in the culture supernatant, concentration that reduces by 50% the HIV produced in the supernatant.
In DepthDetails ArticlePubMed