BDBM50057815 1-(4-Azido-5-hydroxymethyl-tetrahydro-furan-2-yl)-3-(2-methoxy-ethoxymethyl)-5-methyl-1H-pyrimidine-2,4-dione::CHEMBL289786
SMILES COCCOCn1c(=O)c(C)cn(C2CC(N=[N+]=[N-])C(CO)O2)c1=O
InChI Key InChIKey=ABDWYVYEQSWHSG-UHFFFAOYSA-N
Data  1 EC50
  Tab Delimited (TSV)   2D SDfile   Computed 3D by Vconf -m prep SDfile
Find this compound or compounds like it in BindingDB:
Activity Spreadsheet -- Enzyme Inhibition Constant Data from BindingDB
Found 1 hit for monomerid = 50057815
TargetReverse transcriptase/RNaseH(Human immunodeficiency virus 1)
Institut De Chimie Des Substances Naturelles Cnrs
Curated by ChEMBL
LigandPNGBDBM50057815(1-(4-Azido-5-hydroxymethyl-tetrahydro-furan-2-yl)-...)
Affinity DataEC50:  1.40E+5nM. Assay description: Reverse transcriptase activity was measured in the culture supernatant, concentration that reduces by 50% the HIV produced in the supernatant.
In DepthDetails ArticlePubMed