BDBM50058237 (S)-2-(Butane-1-sulfonylamino)-3-{[4-oxo-5-(2-piperidin-4-yl-ethyl)-5,6,7,8-tetrahydro-4H-1,5,8a-triaza-azulene-2-carbonyl]-amino}-propionic acid::CHEMBL300525
SMILES CCCCS(=O)(=O)N[C@@H](CNC(=O)c1cc2C(=O)N(CCC3CCNCC3)CCCn2n1)C(O)=O
InChI Key InChIKey=VYKRADAUJUCJRE-SFHVURJKSA-N
Data  1 Kd
  Tab Delimited (TSV)   2D SDfile   Computed 3D by Vconf -m prep SDfile
Find this compound or compounds like it in BindingDB:
Activity Spreadsheet -- Enzyme Inhibition Constant Data from BindingDB
Found 1 hit for monomerid = 50058237
TargetIntegrin alpha-IIb/beta-3(Homo sapiens (Human))
Merck Research Laboratories
Curated by ChEMBL
LigandPNGBDBM50058237((S)-2-(Butane-1-sulfonylamino)-3-{[4-oxo-5-(2-pipe...)
Affinity DataKd:  1.40nM. Assay description: Displacement of L-736,622 from purified resting Fibrinogen Receptor
In DepthDetails ArticlePubMed