BDBM50058530 (S)-3-{[(1S,9S)-9-(2-Fluoro-benzoylamino)-6,10-dioxo-octahydro-pyridazino[1,2-a][1,2]diazepine-1-carbonyl]-amino}-4-oxo-butyric acid::CHEMBL299288
SMILES OC(=O)C[C@H](NC(=O)[C@@H]1CCCN2N1C(=O)[C@H](CCC2=O)NC(=O)c1ccccc1F)C=O
InChI Key InChIKey=KXAUXHBXAIZBIR-RCBQFDQVSA-N
Data  1 KI
  Tab Delimited (TSV)   2D SDfile   Computed 3D by Vconf -m prep SDfile
Find this compound or compounds like it in BindingDB:
Activity Spreadsheet -- Enzyme Inhibition Constant Data from BindingDB
Found 1 hit for monomerid = 50058530
TargetCaspase-1(Homo sapiens (Human))
Sanofi Winthrop
Curated by ChEMBL
LigandPNGBDBM50058530((S)-3-{[(1S,9S)-9-(2-Fluoro-benzoylamino)-6,10-dio...)
Affinity DataKi:  1nM. Assay description: Reversible Inhibition constants of the compound against IL-1 beta converting enzyme (ICE)
In DepthDetails ArticlePubMed