BDBM50059243 1-Benzyl-4-(5-benzyl-1H-pyrazol-3-yl)-piperidine::CHEMBL77148
SMILES C(N1CCC(CC1)c1cc(Cc2ccccc2)[nH]n1)c1ccccc1
InChI Key InChIKey=QAPWGFAFNBTWSU-UHFFFAOYSA-N
Data  3 KI
  Tab Delimited (TSV)   2D SDfile   Computed 3D by Vconf -m prep SDfile
Find this compound or compounds like it in BindingDB:
Activity Spreadsheet -- Enzyme Inhibition Constant Data from BindingDB
Found 3 hits for monomerid = 50059243
TargetD(4) dopamine receptor(Homo sapiens (Human))
Merck Sharp And Dohme Research Laboratories
Curated by ChEMBL
LigandPNGBDBM50059243(1-Benzyl-4-(5-benzyl-1H-pyrazol-3-yl)-piperidine |...)
Affinity DataKi:  160nM. Assay description: Ability to displace [3H]-spiperone from human dopamine receptor D4 (hD4) receptor stably expressed in HEK-293 cells.
In DepthDetails ArticlePubMed
TargetD(2) dopamine receptor(Homo sapiens (Human))
Merck Sharp And Dohme Research Laboratories
Curated by ChEMBL
LigandPNGBDBM50059243(1-Benzyl-4-(5-benzyl-1H-pyrazol-3-yl)-piperidine |...)
Affinity DataKi:  310nM. Assay description: Ability to displace [3H]-spiperone from human dopamine receptor D2 stably expressed in CHO cells.
In DepthDetails ArticlePubMed
TargetD(3) dopamine receptor(Homo sapiens (Human))
Merck Sharp And Dohme Research Laboratories
Curated by ChEMBL
LigandPNGBDBM50059243(1-Benzyl-4-(5-benzyl-1H-pyrazol-3-yl)-piperidine |...)
Affinity DataKi:  2.10E+3nM. Assay description: Ability to displace [3H]-spiperone from human dopamine receptor D3 (hD3) receptor stably expressed in HEK-293 cells.
In DepthDetails ArticlePubMed