BDBM50059486 (2R,3S)-3-[Bis-(4-fluoro-phenyl)-methoxy]-8-methyl-8-aza-bicyclo[3.2.1]octane-2-carboxylic acid methyl ester::(2R,3S)-methyl 3-(bis(4-fluorophenyl)methoxy)-8-methyl-8-aza-bicyclo[3.2.1]octane-2-carboxylate::(2R,3S,8S)-3-[Bis-(4-fluoro-phenyl)-methoxy]-8-methyl-8-aza-bicyclo[3.2.1]octane-2-carboxylic acid methyl ester::3-[Bis-(4-fluoro-phenyl)-methoxy]-8-methyl-8-aza-bicyclo[3.2.1]octane-2-carboxylic acid methyl ester::CHEMBL310650
SMILES COC(=O)[C@@H]1C2CCC(C[C@@H]1OC(c1ccc(F)cc1)c1ccc(F)cc1)N2C
InChI Key InChIKey=XSYGBVSQKPLETJ-NSKBAKJYSA-N
Data  8 KI  6 IC50
  Tab Delimited (TSV)   2D SDfile   Computed 3D by Vconf -m prep SDfile
Find this compound or compounds like it in BindingDB:
Activity Spreadsheet -- Enzyme Inhibition Constant Data from BindingDB
Found 14 hits for monomerid = 50059486
TargetSodium-dependent dopamine transporter(Rattus norvegicus (rat))
National Institute On Drug Abuse-Intramural Research Program
Curated by ChEMBL
LigandPNGBDBM50059486((2R,3S)-3-[Bis-(4-fluoro-phenyl)-methoxy]-8-methyl...)
Affinity DataKi:  2.94nM. Assay description: Displacement of [3H]WIN-35428 from DAT in Sprague-Dawley rat brain
In DepthDetails ArticlePubMed
TargetSodium-dependent dopamine transporter(Rattus norvegicus (rat))
National Institute On Drug Abuse-Intramural Research Program
Curated by ChEMBL
LigandPNGBDBM50059486((2R,3S)-3-[Bis-(4-fluoro-phenyl)-methoxy]-8-methyl...)
Affinity DataKi:  13.4nM. Assay description: In vitro dopamine transporter binding affinity using [3H]WIN-35428 as radioligand was determined
In DepthDetails ArticlePubMed
TargetMuscarinic acetylcholine receptor M1(RAT)
National Institute On Drug Abuse-Intramural Research Program
Curated by ChEMBL
LigandPNGBDBM50059486((2R,3S)-3-[Bis-(4-fluoro-phenyl)-methoxy]-8-methyl...)
Affinity DataKi:  133nM. Assay description: Displacement of [3H]pirenzepine from M1 receptor in Sprague-Dawley rat brain
In DepthDetails ArticlePubMed
TargetMuscarinic acetylcholine receptor M1(RAT)
National Institute On Drug Abuse-Intramural Research Program
Curated by ChEMBL
LigandPNGBDBM50059486((2R,3S)-3-[Bis-(4-fluoro-phenyl)-methoxy]-8-methyl...)
Affinity DataKi:  133nM. Assay description: Binding affinity towards Muscarinic acetylcholine receptor M1 using [3H]pirenzepine as radioligand was determined
In DepthDetails ArticlePubMed
TargetTransporter(Rattus norvegicus)
National Institute On Drug Abuse
Curated by ChEMBL
LigandPNGBDBM50059486((2R,3S)-3-[Bis-(4-fluoro-phenyl)-methoxy]-8-methyl...)
Affinity DataKi:  269nM. Assay description: Binding affinity towards norepinephrine transporter using [3H]nisoxetine as radioligand was determined
In DepthDetails ArticlePubMed
TargetTransporter(Rattus norvegicus)
National Institute On Drug Abuse
Curated by ChEMBL
LigandPNGBDBM50059486((2R,3S)-3-[Bis-(4-fluoro-phenyl)-methoxy]-8-methyl...)
Affinity DataKi:  269nM. Assay description: Displacement of [3H]nisoxetine from NET in Sprague-Dawley rat brain
In DepthDetails ArticlePubMed
TargetSodium-dependent serotonin transporter(Rattus norvegicus (rat))
National Institute On Drug Abuse
Curated by ChEMBL
LigandPNGBDBM50059486((2R,3S)-3-[Bis-(4-fluoro-phenyl)-methoxy]-8-methyl...)
Affinity DataKi:  690nM. Assay description: Binding affinity towards serotonin transporter using [3H]citalopram as radioligand was determined
In DepthDetails ArticlePubMed
TargetSodium-dependent serotonin transporter(Rattus norvegicus (rat))
National Institute On Drug Abuse
Curated by ChEMBL
LigandPNGBDBM50059486((2R,3S)-3-[Bis-(4-fluoro-phenyl)-methoxy]-8-methyl...)
Affinity DataKi:  690nM. Assay description: Displacement of [3H]citalopram from SERT in Sprague-Dawley rat brain
In DepthDetails ArticlePubMed
TargetSodium-dependent dopamine transporter(Homo sapiens (Human))
Organix
Curated by ChEMBL
LigandPNGBDBM50059486((2R,3S)-3-[Bis-(4-fluoro-phenyl)-methoxy]-8-methyl...)
Affinity DataIC50:  11nM. Assay description: Displacement of [3H]WIN-35428 from monkey dopamine transporter
In DepthDetails ArticlePubMed
TargetSodium-dependent dopamine transporter(Rattus norvegicus (rat))
National Institute On Drug Abuse-Intramural Research Program
Curated by ChEMBL
LigandPNGBDBM50059486((2R,3S)-3-[Bis-(4-fluoro-phenyl)-methoxy]-8-methyl...)
Affinity DataIC50:  1.5nM. Assay description: In vitro potency for inhibiting [3H]- dopamine uptake was determined
In DepthDetails ArticlePubMed
TargetSodium-dependent dopamine transporter(Rattus norvegicus (rat))
National Institute On Drug Abuse-Intramural Research Program
Curated by ChEMBL
LigandPNGBDBM50059486((2R,3S)-3-[Bis-(4-fluoro-phenyl)-methoxy]-8-methyl...)
Affinity DataIC50:  1.5nM. Assay description: Inhibition of [3H]dopamine uptake at DAT in Sprague-Dawley rat brain
In DepthDetails ArticlePubMed
TargetSodium-dependent dopamine transporter(Homo sapiens (Human))
Organix
Curated by ChEMBL
LigandPNGBDBM50059486((2R,3S)-3-[Bis-(4-fluoro-phenyl)-methoxy]-8-methyl...)
Affinity DataIC50:  11nM. Assay description: Inhibition of [3H]WIN-35428 binding to the dopamine transporter (DAT) in monkey caudate-putamen.
In DepthDetails ArticlePubMed
TargetSodium-dependent serotonin transporter(Homo sapiens (Human))
Organix
Curated by ChEMBL
LigandPNGBDBM50059486((2R,3S)-3-[Bis-(4-fluoro-phenyl)-methoxy]-8-methyl...)
Affinity DataIC50:  3.53E+3nM. Assay description: Binding affinity of [3H]citalopram for serotonin transporter in monkey
In DepthDetails ArticlePubMed
TargetSodium-dependent dopamine transporter(Homo sapiens (Human))
Organix
Curated by ChEMBL
LigandPNGBDBM50059486((2R,3S)-3-[Bis-(4-fluoro-phenyl)-methoxy]-8-methyl...)
Affinity DataIC50:  1.35E+4nM. Assay description: Inhibition of [3H]WIN-35428 binding to the dopamine transporter (DAT) in monkey caudate-putamen.
In DepthDetails ArticlePubMed