BDBM50059666 CHEMBL3393634
SMILES Oc1cc(ccc1C(=O)c1[nH]c(Cl)c(Cl)c1-n1c(Cl)c(Cl)cc1C(=O)c1ccc(cc1O)P(O)(O)=O)P(O)(O)=O
InChI Key InChIKey=HAOZEIGBKYXKEC-UHFFFAOYSA-N
Data  1 Kd
  Tab Delimited (TSV)   2D SDfile   Computed 3D by Vconf -m prep SDfile
Find this compound or compounds like it in BindingDB:
Activity Spreadsheet -- Enzyme Inhibition Constant Data from BindingDB
Found 1 hit for monomerid = 50059666
TargetInduced myeloid leukemia cell differentiation protein Mcl-1(Homo sapiens (Human))
University Of Nebraska
Curated by ChEMBL
LigandPNGBDBM50059666(CHEMBL3393634)
Affinity DataKd:  3.50E+3nM. Assay description: Binding affinity to Mcl1 (unknown origin) assessed as fluorescence quenching by intrinsic fluorescence spectra
In DepthDetails ArticlePubMed