BDBM50059672 (S)-2-AMINO-3-[3-HYDROXY-5-(2-METHYL-2H-TETRAZOL-5-YL)ISOXAZOL-4-YL]PROPIONIC ACID::2-Amino-3-[3-hydroxy-5-(2-methyl-2H-tetrazol-5-yl)-isoxazol-4-yl]-propionic acid::CHEMBL94859
SMILES Cn1nnc(n1)-c1o[nH]c(=O)c1CC(N)C(O)=O
InChI Key InChIKey=YXLQKZHKWIKJKC-UHFFFAOYSA-N
Data  4 KI  1 EC50
  Tab Delimited (TSV)   2D SDfile   Computed 3D by Vconf -m prep SDfile
Find this compound or compounds like it in BindingDB:
Activity Spreadsheet -- Enzyme Inhibition Constant Data from BindingDB
Found 5 hits for monomerid = 50059672
TargetGlutamate receptor 3(RAT)
University Of Turin
Curated by ChEMBL
LigandPNGBDBM50059672((S)-2-AMINO-3-[3-HYDROXY-5-(2-METHYL-2H-TETRAZOL-5...)
Affinity DataKi:  2.20nM. Assay description: Displacement of (RS)-[3H]AMPA from recombinant rat GluA3 expressed in baculovirus infected Sf9 insect cell membranes
In DepthDetails ArticlePubMed
TargetGlutamate receptor 4(Rattus norvegicus)
University Of Turin
Curated by ChEMBL
LigandPNGBDBM50059672((S)-2-AMINO-3-[3-HYDROXY-5-(2-METHYL-2H-TETRAZOL-5...)
Affinity DataKi:  2.70nM. Assay description: Displacement of (RS)-[3H]AMPA from recombinant rat GluA4 expressed in baculovirus infected Sf9 insect cell membranes
In DepthDetails ArticlePubMed
TargetGlutamate receptor 2(Rattus norvegicus)
University Of Turin
Curated by ChEMBL
LigandPNGBDBM50059672((S)-2-AMINO-3-[3-HYDROXY-5-(2-METHYL-2H-TETRAZOL-5...)
Affinity DataKi:  3.90nM. Assay description: Displacement of (RS)-[3H]AMPA from recombinant rat GluA2(R) expressed in baculovirus infected Sf9 insect cell membranes
In DepthDetails ArticlePubMed
TargetGlutamate receptor 1(Rattus norvegicus (Rat))
University Of Turin
Curated by ChEMBL
LigandPNGBDBM50059672((S)-2-AMINO-3-[3-HYDROXY-5-(2-METHYL-2H-TETRAZOL-5...)
Affinity DataKi:  5.20nM. Assay description: Displacement of (RS)-[3H]AMPA from recombinant rat GluA1 expressed in baculovirus infected Sf9 insect cell membranes
In DepthDetails ArticlePubMed
TargetGlutamate receptor ionotropic, kainate 3(Rattus norvegicus)
The Danish University Of Pharmaceutical Sciences
Curated by ChEMBL
LigandPNGBDBM50059672((S)-2-AMINO-3-[3-HYDROXY-5-(2-METHYL-2H-TETRAZOL-5...)
Affinity DataEC50:  330nM. Assay description: In vitro activity of the compound at Ionotropic glutamate receptor using cortical wedge assays in rat brain synaptosoma
In DepthDetails ArticlePubMed