BDBM50059811 4-[(S)-((2S,5R)-4-Allyl-2,5-dimethyl-piperazin-1-yl)-(3-methoxy-phenyl)-methyl]-N-ethyl-benzamide::CHEMBL97883
SMILES CCNC(=O)c1ccc(cc1)[C@H](N1C[C@@H](C)N(CC=C)C[C@@H]1C)c1cccc(OC)c1
InChI Key InChIKey=ILKRGFKOTHKFFT-RNHFSVANSA-N
Data  3 IC50
  Tab Delimited (TSV)   2D SDfile   Computed 3D by Vconf -m prep SDfile
Find this compound or compounds like it in BindingDB:
Activity Spreadsheet -- Enzyme Inhibition Constant Data from BindingDB
Found 3 hits for monomerid = 50059811
TargetKappa-type opioid receptor(Cavia porcellus (domestic guinea pig))
National Institute Of Diabetes And Digestive And Kidney Diseases
Curated by ChEMBL
LigandPNGBDBM50059811(4-[(S)-((2S,5R)-4-Allyl-2,5-dimethyl-piperazin-1-y...)
Affinity DataIC50:  1.63E+3nM. Assay description: Binding affinity for Opioid receptor kappa 1 by the inhibition of binding of [3H]U-69593 in guinea pig brain membranes.
In DepthDetails ArticlePubMed
TargetDelta-type opioid receptor(Rattus norvegicus (rat))
National Institute Of Diabetes And Digestive And Kidney Diseases
Curated by ChEMBL
LigandPNGBDBM50059811(4-[(S)-((2S,5R)-4-Allyl-2,5-dimethyl-piperazin-1-y...)
Affinity DataIC50:  34nM. Assay description: Binding affinity for Opioid receptor delta 1 by the inhibition of binding of [3H]DADAL in rat brain membranes.
In DepthDetails ArticlePubMed
TargetMu-type opioid receptor(Rattus norvegicus (rat))
National Institute Of Diabetes And Digestive And Kidney Diseases
Curated by ChEMBL
LigandPNGBDBM50059811(4-[(S)-((2S,5R)-4-Allyl-2,5-dimethyl-piperazin-1-y...)
Affinity DataIC50:  169nM. Assay description: Binding affinity for Opioid receptor mu 1 by the inhibition of binding of [3H]DAMGO in rat brain membranes.
In DepthDetails ArticlePubMed