BDBM50060976 (3-Phenoxy-phenyl)-acetic acid::CHEMBL107066
SMILES OC(=O)Cc1cccc(Oc2ccccc2)c1
InChI Key InChIKey=LEMRHTTWKDVQEI-UHFFFAOYSA-N
Data  2 IC50  1 Kd
  Tab Delimited (TSV)   2D SDfile   Computed 3D by Vconf -m prep SDfile
Find this compound or compounds like it in BindingDB:
Activity Spreadsheet -- Enzyme Inhibition Constant Data from BindingDB
Found 3 hits for monomerid = 50060976
TargetRegulatory protein E2(Human papillomavirus type 16)
Abbott Laboratories
Curated by ChEMBL
LigandPNGBDBM50060976((3-Phenoxy-phenyl)-acetic acid | CHEMBL107066)
Affinity DataKd: >1.00E+7nM. Assay description: Dissociation constant after binding to human papillomavirus E2 DNA-binding domain (DBD) by observing the changes in [15N]-HSQC spectra.
In DepthDetails ArticlePubMed
TargetProstaglandin G/H synthase 2(Mus musculus (Mouse))
TBA
Curated by ChEMBL
LigandPNGBDBM50060976((3-Phenoxy-phenyl)-acetic acid | CHEMBL107066)
Affinity DataIC50:  6.10E+3nM. Assay description: Inhibition of mouse COX2-mediated 2-arachidonoylglycerol oxygenation preincubated for 3 mins before 2-arachidonoylglycerol addition measured after 30...
In DepthDetails ArticlePubMed
TargetGamma-hydroxybutyrate receptor(RAT)
University Of Maryland
Curated by ChEMBL
LigandPNGBDBM50060976((3-Phenoxy-phenyl)-acetic acid | CHEMBL107066)
Affinity DataIC50:  1.63E+4nM. Assay description: Displacement of [3H]-NCS-382 (16 nM) from GHB receptor of rat cerebrocortical membranes
In DepthDetails ArticlePubMed