BDBM50061183 (10R,13S,17S)-17-(2H-Imidazol-2-yl)-10,13-dimethyl-1,2,6,7,8,9,10,11,12,13,14,15,16,17-tetradecahydro-cyclopenta[a]phenanthren-3-one::CHEMBL113407
SMILES C[C@]12CCC3C(CCC4=CC(=O)CC[C@]34C)C1CC[C@@H]2C1N=CC=N1
InChI Key InChIKey=XHLPZHOALCXMQP-FYUNKSCTSA-N
Data  2 IC50
  Tab Delimited (TSV)   2D SDfile   Computed 3D by Vconf -m prep SDfile
Find this compound or compounds like it in BindingDB:
Activity Spreadsheet -- Enzyme Inhibition Constant Data from BindingDB
Found 2 hits for monomerid = 50061183
TargetSteroid 17-alpha-hydroxylase/17,20 lyase(Rattus norvegicus (Rat))
University Of Maryland
Curated by ChEMBL
LigandPNGBDBM50061183((10R,13S,17S)-17-(2H-Imidazol-2-yl)-10,13-dimethyl...)
Affinity DataIC50:  1.50E+3nM. Assay description: Inhibition of rat testicual micrososmal Cytochrome P450 17A1
In DepthDetails ArticlePubMed
TargetSteroid 17-alpha-hydroxylase/17,20 lyase(Homo sapiens (Human))
University Of Maryland
Curated by ChEMBL
LigandPNGBDBM50061183((10R,13S,17S)-17-(2H-Imidazol-2-yl)-10,13-dimethyl...)
Affinity DataIC50:  400nM. Assay description: Inhibition of human testicular microsomal Cytochrome P450 17A1
In DepthDetails ArticlePubMed