BDBM50061184 (10R,13S,17R)-17-Hydroxy-17-(1H-imidazol-4-yl)-10,13-dimethyl-1,2,6,7,8,9,10,11,12,13,14,15,16,17-tetradecahydro-cyclopenta[a]phenanthren-3-one::CHEMBL324066
SMILES C[C@]12CCC3C(CCC4=CC(=O)CC[C@]34C)C1CC[C@]2(O)c1cnc[nH]1
InChI Key InChIKey=AQOMKZOLSRMOLZ-GSQPBCFPSA-N
Data  1 IC50
  Tab Delimited (TSV)   2D SDfile   Computed 3D by Vconf -m prep SDfile
Find this compound or compounds like it in BindingDB:
Activity Spreadsheet -- Enzyme Inhibition Constant Data from BindingDB
Found 1 hit for monomerid = 50061184
TargetSteroid 17-alpha-hydroxylase/17,20 lyase(Homo sapiens (Human))
University Of Maryland
Curated by ChEMBL
LigandPNGBDBM50061184((10R,13S,17R)-17-Hydroxy-17-(1H-imidazol-4-yl)-10,...)
Affinity DataIC50:  1.20E+3nM. Assay description: Inhibition of human testicular microsomal Cytochrome P450 17A1
In DepthDetails ArticlePubMed