BDBM50061190 (10R,13S,17S)-10,13-Dimethyl-17-(2-phenyl-1H-imidazol-4-yl)-2,3,4,7,8,9,10,11,12,13,14,15,16,17-tetradecahydro-1H-cyclopenta[a]phenanthren-3-ol::CHEMBL541717
SMILES C[C@]12CCC3C(CC=C4CC(O)CC[C@]34C)C1CC[C@@H]2c1cnc([nH]1)-c1ccccc1
InChI Key InChIKey=JVUNQIZFNNFUQK-ONRMSGCCSA-N
Data  2 IC50
  Tab Delimited (TSV)   2D SDfile   Computed 3D by Vconf -m prep SDfile
Find this compound or compounds like it in BindingDB:
Activity Spreadsheet -- Enzyme Inhibition Constant Data from BindingDB
Found 2 hits for monomerid = 50061190
TargetSteroid 17-alpha-hydroxylase/17,20 lyase(Rattus norvegicus (Rat))
University Of Maryland
Curated by ChEMBL
LigandPNGBDBM50061190((10R,13S,17S)-10,13-Dimethyl-17-(2-phenyl-1H-imida...)
Affinity DataIC50:  1.50E+3nM. Assay description: Inhibition of rat testicual micrososmal Cytochrome P450 17A1
In DepthDetails ArticlePubMed
TargetSteroid 17-alpha-hydroxylase/17,20 lyase(Homo sapiens (Human))
University Of Maryland
Curated by ChEMBL
LigandPNGBDBM50061190((10R,13S,17S)-10,13-Dimethyl-17-(2-phenyl-1H-imida...)
Affinity DataIC50:  400nM. Assay description: Inhibition of human testicular microsomal Cytochrome P450 17A1
In DepthDetails ArticlePubMed