BDBM50061764 CHEMBL538036::N-(2-Ethyl-phenyl)-N'-(3-ethyl-phenyl)-guanidine; hydrochloride
SMILES CCc1cccc(NC(N)=Nc2ccccc2CC)c1
InChI Key InChIKey=DPDJFWNEKMYNBO-UHFFFAOYSA-N
Data  1 IC50
  Tab Delimited (TSV)   2D SDfile   Computed 3D by Vconf -m prep SDfile
Find this compound or compounds like it in BindingDB:
Activity Spreadsheet -- Enzyme Inhibition Constant Data from BindingDB
Found 1 hit for monomerid = 50061764
TargetSigma non-opioid intracellular receptor 1(Homo sapiens (Human))
Cambridge Neuroscience
Curated by ChEMBL
LigandPNGBDBM50061764(CHEMBL538036 | N-(2-Ethyl-phenyl)-N'-(3-ethyl-phen...)
Affinity DataIC50:  19nM. Assay description: Binding assay for the sigma receptor sites is performed by utilizing [3H]N,N-di-o-tolylguanidine ([3H]DTG) and guinea pig brain membrane suspensions
In DepthDetails ArticlePubMed