BDBM50062269 5-(4-Iodo-phenyl)-1-{2-[4-(2-methoxy-phenyl)-piperazin-1-yl]-ethyl}-pyrrolidin-2-one::CHEMBL42993
SMILES COc1ccccc1N1CCN(CCN2C(CCC2=O)c2ccc(I)cc2)CC1
InChI Key InChIKey=KEQNIHXKRPJYPV-UHFFFAOYSA-N
Data  2 KI
  Tab Delimited (TSV)   2D SDfile   Computed 3D by Vconf -m prep SDfile
Find this compound or compounds like it in BindingDB:
Activity Spreadsheet -- Enzyme Inhibition Constant Data from BindingDB
Found 2 hits for monomerid = 50062269
Target5-hydroxytryptamine receptor 1A(Rattus norvegicus (rat))
University Of Pennsylvania
Curated by ChEMBL
LigandPNGBDBM50062269(5-(4-Iodo-phenyl)-1-{2-[4-(2-methoxy-phenyl)-piper...)
Affinity DataKi:  2.5nM. Assay description: In vitro binding affinity for 5-hydroxytryptamine 1A receptor in rat hippocampal membranes by [125I]-labeled agonist displacement.
In DepthDetails ArticlePubMed
Target5-hydroxytryptamine receptor 1A(Rattus norvegicus (rat))
University Of Pennsylvania
Curated by ChEMBL
LigandPNGBDBM50062269(5-(4-Iodo-phenyl)-1-{2-[4-(2-methoxy-phenyl)-piper...)
Affinity DataKi:  2.54nM. Assay description: In vitro binding affinity for 5-hydroxytryptamine 1A receptor in rat hippocampal membranes by [125I]-labeled agonist displacement.
In DepthDetails ArticlePubMed