BDBM50062376 (2R,3S,8S)-2-(Benzo[1,3]dioxol-5-yloxymethyl)-3-(4-fluoro-phenyl)-8-aza-bicyclo[3.2.1]octane::CHEMBL314878
SMILES Fc1ccc(cc1)[C@H]1CC2CCC(N2)[C@@H]1COc1ccc2OCOc2c1
InChI Key InChIKey=HAHQKXHPHSTOFJ-KNCVXQGMSA-N
Data  3 IC50
  Tab Delimited (TSV)   2D SDfile   Computed 3D by Vconf -m prep SDfile
Find this compound or compounds like it in BindingDB:
Activity Spreadsheet -- Enzyme Inhibition Constant Data from BindingDB
Found 3 hits for monomerid = 50062376
TargetTransporter(Rattus norvegicus)
Research Triangle Institute
Curated by ChEMBL
LigandPNGBDBM50062376((2R,3S,8S)-2-(Benzo[1,3]dioxol-5-yloxymethyl)-3-(4...)
Affinity DataIC50:  2.50E+3nM. Assay description: Inhibition of [3H]nisoxetine (0.5 nM) binding to Noradrenaline transporter
In DepthDetails ArticlePubMed
TargetSodium-dependent dopamine transporter(Rattus norvegicus (rat))
Research Triangle Institute
Curated by ChEMBL
LigandPNGBDBM50062376((2R,3S,8S)-2-(Benzo[1,3]dioxol-5-yloxymethyl)-3-(4...)
Affinity DataIC50:  142nM. Assay description: Displacement of [3H]WIN-35428(0.5 nM) from Dopamine transporter
In DepthDetails ArticlePubMed
TargetSodium-dependent serotonin transporter(Rattus norvegicus (rat))
Research Triangle Institute
Curated by ChEMBL
LigandPNGBDBM50062376((2R,3S,8S)-2-(Benzo[1,3]dioxol-5-yloxymethyl)-3-(4...)
Affinity DataIC50:  90nM. Assay description: Inhibition of [3H]paroxetine (0.2 nM) binding to 5-HT transporter
In DepthDetails ArticlePubMed