BDBM50063128 8-Ethyl-8-methyl-4-trifluoromethyl-6,7,8,9-tetrahydro-1H-pyrido[3,2-g]quinolin-2-one::CHEMBL351148
SMILES CCC1(C)CCc2cc3c(cc(=O)[nH]c3cc2N1)C(F)(F)F
InChI Key InChIKey=AUDNGGNJSXQFMO-UHFFFAOYSA-N
Data  1 KI  2 IC50
  Tab Delimited (TSV)   2D SDfile   Computed 3D by Vconf -m prep SDfile
Find this compound or compounds like it in BindingDB:
Activity Spreadsheet -- Enzyme Inhibition Constant Data from BindingDB
Found 3 hits for monomerid = 50063128
TargetAndrogen receptor(Homo sapiens (Human))
Ligand Pharmaceuticals
Curated by ChEMBL
LigandPNGBDBM50063128(8-Ethyl-8-methyl-4-trifluoromethyl-6,7,8,9-tetrahy...)
Affinity DataKi:  29nM. Assay description: Binding affinity for human androgen receptor in transiently-transfected COS-1 cells.
In DepthDetails ArticlePubMed
TargetAndrogen receptor(Homo sapiens (Human))
Ligand Pharmaceuticals
Curated by ChEMBL
LigandPNGBDBM50063128(8-Ethyl-8-methyl-4-trifluoromethyl-6,7,8,9-tetrahy...)
Affinity DataIC50:  23nM. Assay description: Antagonistic activity against human androgen receptor (hAR) in co-transfected CV-1 cells.
In DepthDetails ArticlePubMed
TargetProgesterone receptor(Homo sapiens (Human))
Ligand Pharmaceuticals
Curated by ChEMBL
LigandPNGBDBM50063128(8-Ethyl-8-methyl-4-trifluoromethyl-6,7,8,9-tetrahy...)
Affinity DataIC50:  543nM. Assay description: Antagonistic activity against human progesterone receptor B (hPR-B) in co-transfected CV-1 cells.
In DepthDetails ArticlePubMed