BDBM50063255 2-(4-Methyl-piperazin-1-yl)-5H-indeno[1,2-b]pyridine::CHEMBL352107
SMILES CN1CCN(CC1)c1ccc2Cc3ccccc3-c2n1
InChI Key InChIKey=JUPOMVKEXZPGAN-UHFFFAOYSA-N
Data  6 KI
  Tab Delimited (TSV)   2D SDfile   Computed 3D by Vconf -m prep SDfile
Find this compound or compounds like it in BindingDB:
Activity Spreadsheet -- Enzyme Inhibition Constant Data from BindingDB
Found 6 hits for monomerid = 50063255
Target5-hydroxytryptamine receptor 3A/3B(Rattus norvegicus)
Universit£
Curated by ChEMBL
LigandPNGBDBM50063255(2-(4-Methyl-piperazin-1-yl)-5H-indeno[1,2-b]pyridi...)
Affinity DataKi:  14nM. Assay description: Ability to displace [3H]granisetron specifically bound to 5-hydroxytryptamine 3 receptor in rat cortical membrane
In DepthDetails ArticlePubMed
TargetSodium-dependent serotonin transporter(Rattus norvegicus (rat))
Universit£
Curated by ChEMBL
LigandPNGBDBM50063255(2-(4-Methyl-piperazin-1-yl)-5H-indeno[1,2-b]pyridi...)
Affinity DataKi:  59nM. Assay description: Ability to displace [3H]paroxetine bound to Serotonin transporter receptor in rat forebrain
In DepthDetails ArticlePubMed
Target5-hydroxytryptamine receptor 2A(Rattus norvegicus (rat))
Universit£
Curated by ChEMBL
LigandPNGBDBM50063255(2-(4-Methyl-piperazin-1-yl)-5H-indeno[1,2-b]pyridi...)
Affinity DataKi:  2.60E+3nM. Assay description: Ability to displace [3H]ketanserin bound to 5-hydroxytryptamine 2A receptor in rat pre-frontal cortex
In DepthDetails ArticlePubMed
Target5-hydroxytryptamine receptor 1B(Rattus norvegicus (Rat))
Universit£
Curated by ChEMBL
LigandPNGBDBM50063255(2-(4-Methyl-piperazin-1-yl)-5H-indeno[1,2-b]pyridi...)
Affinity DataKi:  3.80E+3nM. Assay description: Ability to displace [3H]5-HT bound to 5-hydroxytryptamine 1B receptor in rat striatum
In DepthDetails ArticlePubMed
Target5-hydroxytryptamine receptor 1A(Rattus norvegicus (rat))
Universit£
Curated by ChEMBL
LigandPNGBDBM50063255(2-(4-Methyl-piperazin-1-yl)-5H-indeno[1,2-b]pyridi...)
Affinity DataKi:  5.70E+3nM. Assay description: Ability to displace [3H]- -OH-DPAT bound to 5-hydroxytryptamine 1A receptor in rat hippocampus
In DepthDetails ArticlePubMed
Target5-hydroxytryptamine receptor 2C(Rattus norvegicus (Rat))
Universit£
Curated by ChEMBL
LigandPNGBDBM50063255(2-(4-Methyl-piperazin-1-yl)-5H-indeno[1,2-b]pyridi...)
Affinity DataKi:  1.60E+4nM. Assay description: Ability to displace [3H]mesulergine bound to 5-hydroxytryptamine 2C receptor in rat cortex
In DepthDetails ArticlePubMed