BDBM50063258 6-(4-Methyl-piperazin-1-yl)-phenanthridine::CHEMBL43193
SMILES CN1CCN(CC1)c1nc2ccccc2c2ccccc12
InChI Key InChIKey=ZVJIBTNUNUXAIO-UHFFFAOYSA-N
Data  2 KI
  Tab Delimited (TSV)   2D SDfile   Computed 3D by Vconf -m prep SDfile
Find this compound or compounds like it in BindingDB:
Activity Spreadsheet -- Enzyme Inhibition Constant Data from BindingDB
Found 2 hits for monomerid = 50063258
Target5-hydroxytryptamine receptor 3A/3B(Rattus norvegicus)
Universit£
Curated by ChEMBL
LigandPNGBDBM50063258(6-(4-Methyl-piperazin-1-yl)-phenanthridine | CHEMB...)
Affinity DataKi:  1.90nM. Assay description: Inhibition of [3H]granisetron binding to 5-hydroxytryptamine 3 receptor of rat cortical membrane
In DepthDetails ArticlePubMed
Target5-hydroxytryptamine receptor 3A/3B(Rattus norvegicus)
Universit£
Curated by ChEMBL
LigandPNGBDBM50063258(6-(4-Methyl-piperazin-1-yl)-phenanthridine | CHEMB...)
Affinity DataKi:  1.90nM. Assay description: Ability to displace [3H]granisetron specifically bound to 5-hydroxytryptamine 3 receptor in rat cortical membrane
In DepthDetails ArticlePubMed