BDBM50063480 (3S,10R,13S)-10,13-Dimethyl-17-[1,2,4]triazol-1-yl-2,3,4,7,8,9,10,11,12,13,14,15-dodecahydro-1H-cyclopenta[a]phenanthren-3-ol::CHEMBL310822
SMILES C[C@]12CCC3C(CC=C4C[C@@H](O)CC[C@]34C)C1CC=C2n1cncn1
InChI Key InChIKey=CWWOHKJKERHVSH-KJBVPOJVSA-N
Data  1 KI  3 IC50
  Tab Delimited (TSV)   2D SDfile   Computed 3D by Vconf -m prep SDfile
Find this compound or compounds like it in BindingDB:
Activity Spreadsheet -- Enzyme Inhibition Constant Data from BindingDB
Found 4 hits for monomerid = 50063480
TargetSteroid 17-alpha-hydroxylase/17,20 lyase(Homo sapiens (Human))
University Of Maryland
Curated by ChEMBL
LigandPNGBDBM50063480((3S,10R,13S)-10,13-Dimethyl-17-[1,2,4]triazol-1-yl...)
Affinity DataKi:  23nM. Assay description: Binding affinity for Cytochrome P450 17A1 (17-alpha-hydroxypregnenolone Km=560 nM)
In DepthDetails ArticlePubMed
TargetSteroid 17-alpha-hydroxylase/17,20 lyase(Homo sapiens (Human))
University Of Maryland
Curated by ChEMBL
LigandPNGBDBM50063480((3S,10R,13S)-10,13-Dimethyl-17-[1,2,4]triazol-1-yl...)
Affinity DataIC50:  800nM. Assay description: In vitro cytochrome P450 17A1 inhibition was assayed using the rapid acetic acid releasing assay (AARA), utilizing intact P450c17-expressing Escheric...
In DepthDetails ArticlePubMed
TargetSteroid 17-alpha-hydroxylase/17,20 lyase(Rattus norvegicus (Rat))
University Of Maryland
Curated by ChEMBL
LigandPNGBDBM50063480((3S,10R,13S)-10,13-Dimethyl-17-[1,2,4]triazol-1-yl...)
Affinity DataIC50:  26nM. Assay description: Inhibition of rat cytochrome P450 17A1
In DepthDetails ArticlePubMed
TargetSteroid 17-alpha-hydroxylase/17,20 lyase(Homo sapiens (Human))
University Of Maryland
Curated by ChEMBL
LigandPNGBDBM50063480((3S,10R,13S)-10,13-Dimethyl-17-[1,2,4]triazol-1-yl...)
Affinity DataIC50:  90nM. Assay description: Inhibition of human testicular microsomal Cytochrome P450 17A1
In DepthDetails ArticlePubMed