BDBM50063889 CHEMBL3403625
SMILES OC(=O)CC1OCCn2c1cc1cc(OCc3cc(OC(F)(F)F)cc(c3)C#N)ccc21
InChI Key InChIKey=AATFDQYTMDDOJM-UHFFFAOYSA-N
Data  1 EC50
  Tab Delimited (TSV)   2D SDfile   Computed 3D by Vconf -m prep SDfile
Find this compound or compounds like it in BindingDB:
Activity Spreadsheet -- Enzyme Inhibition Constant Data from BindingDB
Found 1 hit for monomerid = 50063889
TargetSphingosine 1-phosphate receptor 1(Homo sapiens (Human))
Arena Pharmaceuticals
Curated by ChEMBL
LigandPNGBDBM50063889(CHEMBL3403625)
Affinity DataEC50:  6.80nM. Assay description: Agonist activity at human S1P1 receptor assessed as change in cAMP level by homogeneous time resolved fluorescence cyclase assay
In DepthDetails ArticlePubMed