BDBM50064538 CHEMBL60411::N-Cyclohexyl-3-[4-(2-isopropoxy-phenyl)-piperazin-1-ylmethyl]-benzamide
SMILES CC(C)Oc1ccccc1N1CCN(Cc2cccc(c2)C(=O)NC2CCCCC2)CC1
InChI Key InChIKey=QFEOODXDJUNLCP-UHFFFAOYSA-N
Data  2 KI
  Tab Delimited (TSV)   2D SDfile   Computed 3D by Vconf -m prep SDfile
Find this compound or compounds like it in BindingDB:
Activity Spreadsheet -- Enzyme Inhibition Constant Data from BindingDB
Found 2 hits for monomerid = 50064538
Target5-hydroxytryptamine receptor 1A(Rattus norvegicus (rat))
R. W. Johnson Pharmaceutical Research Institute
Curated by ChEMBL
LigandPNGBDBM50064538(CHEMBL60411 | N-Cyclohexyl-3-[4-(2-isopropoxy-phen...)
Affinity DataKi:  4.10nM. Assay description: Compound was evaluated for its binding affinity against 5-hydroxytryptamine 1A receptor from rat cerebral cortex
In DepthDetails ArticlePubMed
TargetD(2) dopamine receptor(Rattus norvegicus (rat))
R. W. Johnson Pharmaceutical Research Institute
Curated by ChEMBL
LigandPNGBDBM50064538(CHEMBL60411 | N-Cyclohexyl-3-[4-(2-isopropoxy-phen...)
Affinity DataKi:  47nM. Assay description: Binding affinity against Dopamine receptor D2 from rat striatum
In DepthDetails ArticlePubMed