BDBM50064582 6-{2-[4-(2-Hydroxy-phenyl)-piperazin-1-yl]-ethyl}-3-methyl-3H-benzothiazol-2-one::CHEMBL60447
SMILES Cn1c2ccc(CCN3CCN(CC3)c3ccccc3O)cc2sc1=O
InChI Key InChIKey=XBYOOBNCVDFUQE-UHFFFAOYSA-N
Data  5 IC50
  Tab Delimited (TSV)   2D SDfile   Computed 3D by Vconf -m prep SDfile
Find this compound or compounds like it in BindingDB:
Activity Spreadsheet -- Enzyme Inhibition Constant Data from BindingDB
Found 5 hits for monomerid = 50064582
Target5-hydroxytryptamine receptor 1A(Homo sapiens (Human))
Institut De Chimie Pharmaceutique Albert Lespagnol
Curated by ChEMBL
LigandPNGBDBM50064582(6-{2-[4-(2-Hydroxy-phenyl)-piperazin-1-yl]-ethyl}-...)
Affinity DataIC50:  0.200nM. Assay description: Affinity towards 5-hydroxytryptamine 1A receptor in membranes from bovine hippocampus using [3H]-OH-DPAT
In DepthDetails ArticlePubMed
Target5-hydroxytryptamine receptor 1B(Rattus norvegicus (Rat))
Institut De Chimie Pharmaceutique Albert Lespagnol
Curated by ChEMBL
LigandPNGBDBM50064582(6-{2-[4-(2-Hydroxy-phenyl)-piperazin-1-yl]-ethyl}-...)
Affinity DataIC50:  31nM. Assay description: Affinity towards 5-hydroxytryptamine 1B receptor in membranes from rat frontal cortex using [3H]-5-HT
In DepthDetails ArticlePubMed
Target5-hydroxytryptamine receptor 2C(Homo sapiens (Human))
Institut De Chimie Pharmaceutique Albert Lespagnol
Curated by ChEMBL
LigandPNGBDBM50064582(6-{2-[4-(2-Hydroxy-phenyl)-piperazin-1-yl]-ethyl}-...)
Affinity DataIC50:  2.00E+3nM. Assay description: Affinity towards 5-hydroxytryptamine 2C receptor in membranes from pig choroid plexus using [3H]-N-methyl-mesulergine
In DepthDetails ArticlePubMed
TargetD(2) dopamine receptor(BOVINE)
Institut De Chimie Pharmaceutique Albert Lespagnol
Curated by ChEMBL
LigandPNGBDBM50064582(6-{2-[4-(2-Hydroxy-phenyl)-piperazin-1-yl]-ethyl}-...)
Affinity DataIC50:  71nM. Assay description: Affinity towards Dopamine receptor D2 in membranes from bovine striatum using [3H]-raclopride
In DepthDetails ArticlePubMed
Target5-hydroxytryptamine receptor 2A(BOVINE)
Institut De Chimie Pharmaceutique Albert Lespagnol
Curated by ChEMBL
LigandPNGBDBM50064582(6-{2-[4-(2-Hydroxy-phenyl)-piperazin-1-yl]-ethyl}-...)
Affinity DataIC50:  1.10E+3nM. Assay description: Affinity towards 5-hydroxytryptamine 2A receptor in membranes from bovine frontal cortex using [3H]-Ketanserin
In DepthDetails ArticlePubMed