BDBM50064695 4-[2-(5-Amino-2-furan-2-yl-pyrazolo[4,3-e][1,2,4]triazolo[1,5-c]pyrimidin-7-yl)-ethyl]-phenol::CHEMBL67994
SMILES Nc1nc2n(CCc3ccc(O)cc3)ncc2c2nc(nn12)-c1ccco1
InChI Key InChIKey=HTBACUGZYGOBQR-UHFFFAOYSA-N
Data  3 KI  1 IC50
  Tab Delimited (TSV)   2D SDfile   Computed 3D by Vconf -m prep SDfile
Find this compound or compounds like it in BindingDB:
Activity Spreadsheet -- Enzyme Inhibition Constant Data from BindingDB
Found 4 hits for monomerid = 50064695
TargetAdenosine receptor A2a(Rattus norvegicus (rat))
Università
Curated by ChEMBL
LigandPNGBDBM50064695(4-[2-(5-Amino-2-furan-2-yl-pyrazolo[4,3-e][1,2,4]t...)
Affinity DataKi:  1.70nM. Assay description: Displacement of [3H]-CGS- 21680 from rat striatal membranes Adenosine A2A receptor. Parenthesis indicate 95% confidence limits.
In DepthDetails ArticlePubMed
TargetAdenosine receptor A1(Rattus norvegicus (rat))
Università
Curated by ChEMBL
LigandPNGBDBM50064695(4-[2-(5-Amino-2-furan-2-yl-pyrazolo[4,3-e][1,2,4]t...)
Affinity DataKi:  444nM. Assay description: Displacement of [3H]-CHA from rat cortical membrane Adenosine A1 receptor. Parenthesis indicate 95% confidence limit.
In DepthDetails ArticlePubMed
TargetAdenosine receptor A3(Homo sapiens (Human))
Università
Curated by ChEMBL
LigandPNGBDBM50064695(4-[2-(5-Amino-2-furan-2-yl-pyrazolo[4,3-e][1,2,4]t...)
Affinity DataKi: >1.00E+4nM. Assay description: Displacement of [125I]-AB-MECA from human Adenosine A3 receptor expressed in HEK-293 cells
In DepthDetails ArticlePubMed
TargetAdenosine receptor A2a(Homo sapiens (Human))
Università
Curated by ChEMBL
LigandPNGBDBM50064695(4-[2-(5-Amino-2-furan-2-yl-pyrazolo[4,3-e][1,2,4]t...)
Affinity DataIC50:  14nM. Assay description: Inhibition of 1 uM NECA-stimulated cyclic AMP levels in human platelets
In DepthDetails ArticlePubMed