BDBM50064721 1-(1-{5-Fluoro-2-methoxy-4-[1-(1-oxy-6,7-dihydro-5H-[1]pyrindin-5-yl)-piperidin-4-yloxy]-benzoyl}-piperidin-4-yl)-1,4-dihydro-benzo[d][1,3]oxazin-2-one::CHEMBL68816
SMILES COc1cc(OC2CCN(CC2)C2CCc3c2ccc[n+]3[O-])c(F)cc1C(=O)N1CCC(CC1)N1C(=O)OCc2ccccc12
InChI Key InChIKey=BPKAODVGZHYQQN-UHFFFAOYSA-N
Data  1 KI
  Tab Delimited (TSV)   2D SDfile   Computed 3D by Vconf -m prep SDfile
Find this compound or compounds like it in BindingDB:
Activity Spreadsheet -- Enzyme Inhibition Constant Data from BindingDB
Found 1 hit for monomerid = 50064721
TargetOxytocin receptor(Homo sapiens (Human))
Merck Research Laboratories
Curated by ChEMBL
LigandPNGBDBM50064721(1-(1-{5-Fluoro-2-methoxy-4-[1-(1-oxy-6,7-dihydro-5...)
Affinity DataKi:  3.30nM. Assay description: Binding affinity for cloned human oxytocin receptor (OT-R)
In DepthDetails ArticlePubMed