BDBM50064811 2-(4-Nitro-benzyl)-4,5-dihydro-1H-imidazole::CHEMBL71751
SMILES [O-][N+](=O)c1ccc(CC2=[NH+]CC[N-]2)cc1
InChI Key InChIKey=OWJSKNRUTJBLFK-UHFFFAOYSA-O
Data  2 KI
  Tab Delimited (TSV)   2D SDfile   Computed 3D by Vconf -m prep SDfile
Find this compound or compounds like it in BindingDB:
Activity Spreadsheet -- Enzyme Inhibition Constant Data from BindingDB
Found 2 hits for monomerid = 50064811
Target5-hydroxytryptamine receptor 1D(Homo sapiens (Human))
Virginia Commonwealth University
Curated by ChEMBL
LigandPNGBDBM50064811(2-(4-Nitro-benzyl)-4,5-dihydro-1H-imidazole | CHEM...)
Affinity DataKi: >1.00E+4nM. Assay description: Binding affinity towards human 5-hydroxytryptamine 1D receptor using [3H]-5-HT trifluoroacetate as radioligand
In DepthDetails ArticlePubMed
Target5-hydroxytryptamine receptor 1B(Homo sapiens (Human))
Virginia Commonwealth University
Curated by ChEMBL
LigandPNGBDBM50064811(2-(4-Nitro-benzyl)-4,5-dihydro-1H-imidazole | CHEM...)
Affinity DataKi: >1.00E+4nM. Assay description: Binding affinity towards human 5-hydroxytryptamine 1B receptor using [3H]-5-HT trifluoroacetate as radioligand
In DepthDetails ArticlePubMed