BDBM50065435 CHEMBL3401351
SMILES [H][C@@]1(CC[C@@]2([H])[C@]3([H])CC[C@]4([H])C[C@H](O)CC[C@]4(C)[C@@]3([H])CC[C@]12C)[C@H](C)C[C@H](C)C(O)=O
InChI Key InChIKey=DNTJEWIAGFGJKP-DCOQOMBNSA-N
Data  1 EC50
  Tab Delimited (TSV)   2D SDfile   Computed 3D by Vconf -m prep SDfile
Find this compound or compounds like it in BindingDB:
Activity Spreadsheet -- Enzyme Inhibition Constant Data from BindingDB
Found 1 hit for monomerid = 50065435
TargetG-protein coupled bile acid receptor 1(Homo sapiens (Human))
The Beckman Research Institute
Curated by ChEMBL
LigandPNGBDBM50065435(CHEMBL3401351)
Affinity DataEC50:  220nM. Assay description: Agonist activity at human GPBAR1 expressed in HEK293 cells assessed as increase in intracellular cAMP level after 30 mins by cAMP-Glo assay
In DepthDetails ArticlePubMed