BDBM50065521 4-[2-Acetyl-5-(thiophen-3-ylmethoxy)-phenoxy]-4-o-tolyl-butyric acid::CHEMBL93776
SMILES CC(=O)c1ccc(OCc2ccsc2)cc1OC(CCC(O)=O)c1ccccc1C
InChI Key InChIKey=ULMFTQRBVDYESB-UHFFFAOYSA-N
Data  2 IC50
  Tab Delimited (TSV)   2D SDfile   Computed 3D by Vconf -m prep SDfile
Find this compound or compounds like it in BindingDB:
Activity Spreadsheet -- Enzyme Inhibition Constant Data from BindingDB
Found 2 hits for monomerid = 50065521
TargetEndothelin-1 receptor(RAT)
Rh£Ne-Poulenc Rorer
Curated by ChEMBL
LigandPNGBDBM50065521(4-[2-Acetyl-5-(thiophen-3-ylmethoxy)-phenoxy]-4-o-...)
Affinity DataIC50:  26nM. Assay description: In vitro inhibition of [125I]ET1 binding to rat A10 cell Endothelin A receptor.
In DepthDetails ArticlePubMed
TargetEndothelin receptor type B(RAT)
Rh£Ne-Poulenc Rorer
Curated by ChEMBL
LigandPNGBDBM50065521(4-[2-Acetyl-5-(thiophen-3-ylmethoxy)-phenoxy]-4-o-...)
Affinity DataIC50:  1.00E+4nM. Assay description: In vitro inhibition of [125I]ET1 binding to rat cerebellum Endothelin B receptor.
In DepthDetails ArticlePubMed