BDBM50065524 5-[2-(3-Carboxy-1-o-tolyl-propoxy)-4-(thiophen-3-ylmethoxy)-phenyl]-2H-pyrazole-3-carboxylic acid::CHEMBL330679
SMILES Cc1ccccc1C(CCC(O)=O)Oc1cc(OCc2ccsc2)ccc1-c1cc([nH]n1)C(O)=O
InChI Key InChIKey=RFRUKNFJQPSBDV-UHFFFAOYSA-N
Data  2 IC50
  Tab Delimited (TSV)   2D SDfile   Computed 3D by Vconf -m prep SDfile
Find this compound or compounds like it in BindingDB:
Activity Spreadsheet -- Enzyme Inhibition Constant Data from BindingDB
Found 2 hits for monomerid = 50065524
TargetEndothelin receptor type B(RAT)
Rh£Ne-Poulenc Rorer
Curated by ChEMBL
LigandPNGBDBM50065524(5-[2-(3-Carboxy-1-o-tolyl-propoxy)-4-(thiophen-3-y...)
Affinity DataIC50:  3.00E+3nM. Assay description: In vitro inhibition of [125I]ET1 binding to rat cerebellum Endothelin B receptor.
In DepthDetails ArticlePubMed
TargetEndothelin-1 receptor(RAT)
Rh£Ne-Poulenc Rorer
Curated by ChEMBL
LigandPNGBDBM50065524(5-[2-(3-Carboxy-1-o-tolyl-propoxy)-4-(thiophen-3-y...)
Affinity DataIC50:  7nM. Assay description: In vitro inhibition of [125I]ET1 binding to rat A10 cell Endothelin A receptor.
In DepthDetails ArticlePubMed