BDBM50065525 4-[2-(1H-Pyrazol-3-yl)-5-(thiophen-3-ylmethoxy)-phenoxy]-4-o-tolyl-butyric acid::CHEMBL91753
SMILES Cc1ccccc1C(CCC(O)=O)Oc1cc(OCc2ccsc2)ccc1-c1cc[nH]n1
InChI Key InChIKey=BSJOXPZITWSTQE-UHFFFAOYSA-N
Data  2 IC50
  Tab Delimited (TSV)   2D SDfile   Computed 3D by Vconf -m prep SDfile
Find this compound or compounds like it in BindingDB:
Activity Spreadsheet -- Enzyme Inhibition Constant Data from BindingDB
Found 2 hits for monomerid = 50065525
TargetEndothelin receptor type B(RAT)
Rh£Ne-Poulenc Rorer
Curated by ChEMBL
LigandPNGBDBM50065525(4-[2-(1H-Pyrazol-3-yl)-5-(thiophen-3-ylmethoxy)-ph...)
Affinity DataIC50:  1.00E+4nM. Assay description: In vitro inhibition of [125I]ET1 binding to rat cerebellum Endothelin B receptor.
In DepthDetails ArticlePubMed
TargetEndothelin-1 receptor(RAT)
Rh£Ne-Poulenc Rorer
Curated by ChEMBL
LigandPNGBDBM50065525(4-[2-(1H-Pyrazol-3-yl)-5-(thiophen-3-ylmethoxy)-ph...)
Affinity DataIC50:  20nM. Assay description: In vitro inhibition of [125I]ET1 binding to rat A10 cell Endothelin A receptor.
In DepthDetails ArticlePubMed